{"text_format":"1","workbook":"xlsx","n_sheets":6,"sheets":["はじめに","活動記録 ","会議録","金銭出納簿（今年度）","金銭出納簿（前年度）","【選択肢】"],"not_rendered":{"charts":0,"images":2,"macros":0,"external_links":0,"defined_names":63,"comments":2,"pivot_tables":0},"unopened":[],"bounds":{"document_bytes":16777216,"sheet_cells":100000,"rows_first":2000,"rows_last":500,"rows_between":2000,"halvings":0,"cell_chars":16384,"cell_head_chars":4096},"cells_cut":0,"cells_raw":0,"read":"whole","date_system":"1900"}

{"sheet":"はじめに","index":0,"n_rows":26,"n_cols":7,"rows_kept":26,"cut":false,"hidden":false,"merged":[[16,158,16,160],[16,161,16,163],[16,164,16,166],[16,200,16,202],[16,203,16,205],[16,206,16,208],[16,209,16,211],[16,212,16,214],[16,134,16,136],[16,137,16,139],[16,140,16,142],[16,143,16,145],[16,146,16,148],[16,149,16,151],[16,152,16,154],[16,155,16,157],[19,62,19,64],[19,119,19,121],[19,122,19,124],[19,125,19,127],[19,128,19,130],[19,146,19,148],[19,212,19,214],[19,179,19,181],[19,182,19,184],[19,188,19,190],[19,98,19,100],[19,101,19,103],[19,104,19,106],[19,107,19,109],[19,110,19,112],[19,113,19,115],[19,116,19,118],[19,155,19,157],[19,215,19,217],[19,149,19,151],[19,152,19,154],[19,140,19,142],[19,143,19,145],[19,65,19,67],[19,68,19,70],[19,71,19,73],[19,245,19,247],[19,74,19,76],[19,77,19,79],[19,80,19,82],[19,83,19,85],[19,86,19,88],[19,89,19,91],[19,92,19,94],[19,95,19,97],[19,131,19,133],[19,134,19,136],[19,137,19,139],[19,185,19,187],[19,206,19,208],[19,209,19,211],[19,176,19,178],[19,251,19,253],[19,254,19,256],[19,257,19,257],[19,227,19,229],[19,230,19,232],[19,233,19,235],[19,236,19,238],[19,239,19,241],[19,158,19,160],[19,161,19,163],[19,164,19,166],[19,167,19,169],[19,170,19,172],[19,242,19,244],[19,218,19,220],[19,221,19,223],[19,224,19,226],[19,191,19,193],[19,194,19,196],[19,197,19,199],[19,200,19,202],[19,203,19,205],[19,248,19,250],[19,173,19,175],[16,110,16,112],[16,113,16,115],[16,116,16,118],[16,119,16,121],[16,122,16,124],[16,125,16,127],[16,128,16,130],[16,131,16,133],[16,101,16,103],[16,104,16,106],[16,107,16,109],[16,254,16,256],[16,167,16,169],[16,170,16,172],[16,173,16,175],[16,176,16,178],[16,179,16,181],[16,182,16,184],[16,185,16,187],[16,188,16,190],[16,191,16,193],[16,248,16,250],[16,251,16,253],[16,218,16,220],[16,221,16,223],[16,224,16,226],[16,227,16,229],[16,230,16,232],[16,233,16,235],[16,242,16,244],[16,245,16,247],[16,215,16,217],[16,257,16,257],[16,236,16,238],[16,239,16,241],[16,9,16,10],[16,11,16,13],[16,14,16,16],[16,17,16,19],[16,20,16,22],[16,23,16,25],[16,26,16,28],[16,29,16,31],[16,32,16,34],[16,35,16,37],[16,38,16,40],[16,41,16,43],[16,44,16,46],[16,47,16,49],[16,50,16,52],[16,53,16,55],[16,56,16,58],[16,59,16,61],[16,62,16,64],[16,194,16,196],[16,197,16,199],[14,185,14,187],[14,188,14,190],[14,191,14,193],[14,104,14,106],[14,107,14,109],[14,110,14,112],[14,113,14,115],[14,116,14,118],[14,119,14,121],[14,122,14,124],[14,125,14,127],[14,128,14,130],[14,131,14,133],[14,134,14,136],[14,137,14,139],[14,140,14,142],[14,143,14,145],[14,146,14,148],[14,179,14,181],[14,182,14,184],[14,155,14,157],[14,149,14,151],[14,152,14,154],[14,176,14,178],[14,32,14,34],[14,56,14,58],[14,233,14,235],[14,236,14,238],[14,257,14,257],[14,239,14,241],[14,242,14,244],[14,245,14,247],[14,248,14,250],[14,251,14,253],[14,254,14,256],[14,221,14,223],[14,224,14,226],[14,227,14,229],[14,230,14,232],[14,194,14,196],[14,197,14,199],[14,200,14,202],[14,203,14,205],[14,206,14,208],[14,209,14,211],[14,212,14,214],[14,215,14,217],[14,218,14,220],[14,167,14,169],[14,170,14,172],[14,173,14,175],[14,77,14,79],[14,80,14,82],[14,89,14,91],[14,92,14,94],[14,95,14,97],[14,158,14,160],[14,161,14,163],[14,164,14,166],[14,98,14,100],[14,101,14,103],[16,89,16,91],[16,92,16,94],[16,95,16,97],[16,98,16,100],[14,74,14,76],[14,62,14,64],[14,65,14,67],[14,59,14,61],[16,80,16,82],[14,83,14,85],[14,86,14,88],[16,65,16,67],[16,68,16,70],[16,71,16,73],[16,74,16,76],[16,77,16,79],[14,68,14,70],[14,71,14,73],[16,83,16,85],[16,86,16,88],[19,59,19,61],[14,17,14,19],[14,20,14,22],[14,23,14,25],[14,26,14,28],[19,32,19,34],[19,35,19,37],[19,20,19,22],[19,23,19,25],[19,26,19,28],[19,38,19,40],[19,41,19,43],[19,44,19,46],[19,47,19,49],[19,50,19,52],[19,53,19,55],[19,56,19,58],[14,35,14,37],[14,38,14,40],[14,41,14,43],[14,44,14,46],[14,47,14,49],[14,50,14,52],[14,53,14,55],[14,14,14,16],[13,1,13,6],[19,11,19,13],[19,14,19,16],[19,17,19,19],[19,29,19,31],[21,1,21,2],[21,3,21,4],[2,4,2,6],[3,4,3,6],[17,1,17,6],[4,3,4,6],[6,3,6,6],[10,1,10,6],[9,1,9,6],[16,1,16,6],[15,1,15,6],[12,1,12,6],[14,1,14,6],[19,9,19,10],[14,29,14,31],[8,10,8,12],[23,1,23,2],[23,3,23,4],[24,3,25,4],[24,1,25,2],[24,5,25,5],[22,1,22,2],[22,3,22,4],[14,9,14,10],[14,11,14,13]]}
["中山間地域等直接支払交付金参考様式集（第6期対策）"]
["★基本情報入力欄　はじめに太枠内の情報を入力してください。"]
[null,"都道府県名",null,"新潟県","　←　「都道府県」まで記入してください。"]
[null,"市町村名",null,"上越市","　←　「市町村」まで記入してください。"]
[null,"協定名"]
[null,"代表者名"]
[null,"協定所在地"]
[]
["★記入の手順と注意事項"]
[null,"・「★提出書類と各シートの説明」のシート名をクリックすることで、入力する様式に移動します。または、画面下の様式名を選択すると、入力する様式を切り替えることができます。左下の◀▶をクリックすることで、隠れている様式を表示させることができます。"]
[null,"（※まず初めに、「別紙２①」の「農用地の内訳等及びネットワーク化活動計画」を入力すると作成がスムーズです。）"]
[]
[null,"・すべての集落協定の方が入力する必要のあるセルには、この色が塗ってあります。"]
[null,"・該当する場合に、集落協定の方が入力する必要のあるセルには、この色が塗ってあります。"]
[null,"・この色（黄緑色）が塗ってあるセルは自動入力されます。自動入力されたものが間違っている場合は、正しく修正してください。（入力されている数式を消去すると、自由に入力できます。）"]
{"$rows_left_out":12}
{"sheet":"活動記録 ","index":1,"n_rows":27,"n_cols":15,"rows_kept":27,"cut":false,"hidden":false,"merged":[[62,1,64,1],[62,2,64,2],[62,13,64,13],[62,14,64,14],[65,1,67,1],[65,2,67,2],[65,13,67,13],[65,14,67,14],[56,1,58,1],[56,2,58,2],[56,13,58,13],[56,14,58,14],[59,1,61,1],[59,2,61,2],[59,13,61,13],[59,14,61,14],[50,1,52,1],[50,2,52,2],[50,13,52,13],[50,14,52,14],[53,1,55,1],[53,2,55,2],[53,13,55,13],[53,14,55,14],[44,1,46,1],[44,2,46,2],[44,13,46,13],[44,14,46,14],[47,1,49,1],[47,2,49,2],[47,13,49,13],[47,14,49,14],[38,1,40,1],[38,2,40,2],[38,13,40,13],[38,14,40,14],[41,1,43,1],[41,2,43,2],[41,13,43,13],[41,14,43,14],[32,1,34,1],[32,2,34,2],[32,13,34,13],[32,14,34,14],[35,1,37,1],[35,2,37,2],[35,13,37,13],[35,14,37,14],[29,1,31,1],[29,2,31,2],[29,13,31,13],[29,14,31,14],[6,15,8,21],[7,1,8,1],[7,3,8,3],[7,4,8,4],[7,5,8,5],[7,12,8,12],[7,13,8,13],[7,2,8,2],[5,1,5,14],[6,1,6,2],[6,3,6,5],[6,6,8,11],[6,12,6,13],[6,14,8,14]]}
[]
[null,null,null,null,null,null,null,null,null,null,null,null,null,"協定名：",{"$f":"はじめに!D5&\"\"","v":""}]
[null,null,null,null,null,"令和7年度","　中山間地域等直接支払交付金　活動記録"]
[null,null,null,null,null,null,null,"（多面的機能支払交付金との共通様式）"]
[null,"★「実施時間」には休憩時間を含めず、実働時間を記入してください。"]
[null,"\n★中山間地域等直接支払交付金の活動の場合、「活動項目番号」欄には、シート【選択肢】のQ列67番以降から選択。\n★多面的機能支払交付金の活動の場合、「活動項目番号」欄には、実施要領別記1-2の国が定める活動指針における活動項目の番号及び要領第1の２の(1)に基づき\n　都道府県が定める要綱基本方針において追加された活動項目の番号を記入します。その他、事務処理は200番、会議等は300番を記入します。\n　同一日に複数の活動を行った場合は、該当する全ての活動項目番号を左詰めで一行に記入してください。番号欄が足りない場合は、複数行に分けて記入してください。\n　　"]
[null,"活動実施日及び活動時間",null,"活動参加人数",null,null,"活動項目番号（左詰め）\n（中山間地域等直接支払交付金の活動の場合\nシート【選択肢】のQ列67番以降から選択）",null,null,null,null,null,"活動内容",null,"備考（具体的な活動内容を記入）"]
[null,"日付","活動時間","農業者","農業者\n以外","総参加\n人数",null,null,null,null,null,null,"支払区分","活動項目"]
[]
[null,null,null,null,null,{"$f":"SUM(D10+E10)","v":0},null,null,null,null,null,null,{"$f":"IF(G10=\"\",\"\",(IFERROR(VLOOKUP($G10,【選択肢】!$Q$3:$S$118,2,),\" \")&IF(H10=\"\",\"\",\",\"&IFERROR(VLOOKUP($H10,【選択肢】!$Q$3:$S$118,2,),\" \")&IF(I10=\"\",\"\",\",\"&IFERROR(VLOOKUP($I10,【選択肢】!$Q$3:$S$118,2,),\" \")&IF(J10=\"\",\"\",\",\"&IFERROR(VLOOKUP($J10,【選択肢】!$Q$3:$S$118,2,),\" \")&IF(K10=\"\",\"\",\",\"&IFERROR(VLOOKUP($K10,【選択肢】!$Q$3:$S$118,2,),\" \")&IF(L10=\"\",\"\",\",\"&IFERROR(VLOOKUP($L10,【選択肢】!$Q$3:$S$118,2,),\" \"))))))))","v":""},{"$f":"IF(G10=\"\",\"\",(IFERROR(VLOOKUP($G10,【選択肢】!$Q$3:$S$118,3,),\" \")&IF(H10=\"\",\"\",\",\"&IFERROR(VLOOKUP($H10,【選択肢】!$Q$3:$S$118,3,),\" \")&IF(I10=\"\",\"\",\",\"&IFERROR(VLOOKUP($I10,【選択肢】!$Q$3:$S$118,3,),\" \")&IF(J10=\"\",\"\",\",\"&IFERROR(VLOOKUP($J10,【選択肢】!$Q$3:$S$118,3,),\" \")&IF(K10=\"\",\"\",\",\"&IFERROR(VLOOKUP($K10,【選択肢】!$Q$3:$S$118,3,),\" \")&IF(L10=\"\",\"\",\",\"&IFERROR(VLOOKUP($L10,【選択肢】!$Q$3:$S$118,3,),\" \"))))))))","v":""}]
[null,null,null,null,null,{"$f":"SUM(D11+E11)","v":0},null,null,null,null,null,null,{"$f":"IF(G11=\"\",\"\",(IFERROR(VLOOKUP($G11,【選択肢】!$Q$3:$S$118,2,),\" \")&IF(H11=\"\",\"\",\",\"&IFERROR(VLOOKUP($H11,【選択肢】!$Q$3:$S$118,2,),\" \")&IF(I11=\"\",\"\",\",\"&IFERROR(VLOOKUP($I11,【選択肢】!$Q$3:$S$118,2,),\" \")&IF(J11=\"\",\"\",\",\"&IFERROR(VLOOKUP($J11,【選択肢】!$Q$3:$S$118,2,),\" \")&IF(K11=\"\",\"\",\",\"&IFERROR(VLOOKUP($K11,【選択肢】!$Q$3:$S$118,2,),\" \")&IF(L11=\"\",\"\",\",\"&IFERROR(VLOOKUP($L11,【選択肢】!$Q$3:$S$118,2,),\" \"))))))))","v":""},{"$f":"IF(G11=\"\",\"\",(IFERROR(VLOOKUP($G11,【選択肢】!$Q$3:$S$118,3,),\" \")&IF(H11=\"\",\"\",\",\"&IFERROR(VLOOKUP($H11,【選択肢】!$Q$3:$S$118,3,),\" \")&IF(I11=\"\",\"\",\",\"&IFERROR(VLOOKUP($I11,【選択肢】!$Q$3:$S$118,3,),\" \")&IF(J11=\"\",\"\",\",\"&IFERROR(VLOOKUP($J11,【選択肢】!$Q$3:$S$118,3,),\" \")&IF(K11=\"\",\"\",\",\"&IFERROR(VLOOKUP($K11,【選択肢】!$Q$3:$S$118,3,),\" \")&IF(L11=\"\",\"\",\",\"&IFERROR(VLOOKUP($L11,【選択肢】!$Q$3:$S$118,3,),\" \"))))))))","v":""}]
[null,null,null,null,null,{"$f":"SUM(D12+E12)","v":0},null,null,null,null,null,null,{"$f":"IF(G12=\"\",\"\",(IFERROR(VLOOKUP($G12,【選択肢】!$Q$3:$S$118,2,),\" \")&IF(H12=\"\",\"\",\",\"&IFERROR(VLOOKUP($H12,【選択肢】!$Q$3:$S$118,2,),\" \")&IF(I12=\"\",\"\",\",\"&IFERROR(VLOOKUP($I12,【選択肢】!$Q$3:$S$118,2,),\" \")&IF(J12=\"\",\"\",\",\"&IFERROR(VLOOKUP($J12,【選択肢】!$Q$3:$S$118,2,),\" \")&IF(K12=\"\",\"\",\",\"&IFERROR(VLOOKUP($K12,【選択肢】!$Q$3:$S$118,2,),\" \")&IF(L12=\"\",\"\",\",\"&IFERROR(VLOOKUP($L12,【選択肢】!$Q$3:$S$118,2,),\" \"))))))))","v":""},{"$f":"IF(G12=\"\",\"\",(IFERROR(VLOOKUP($G12,【選択肢】!$Q$3:$S$118,3,),\" \")&IF(H12=\"\",\"\",\",\"&IFERROR(VLOOKUP($H12,【選択肢】!$Q$3:$S$118,3,),\" \")&IF(I12=\"\",\"\",\",\"&IFERROR(VLOOKUP($I12,【選択肢】!$Q$3:$S$118,3,),\" \")&IF(J12=\"\",\"\",\",\"&IFERROR(VLOOKUP($J12,【選択肢】!$Q$3:$S$118,3,),\" \")&IF(K12=\"\",\"\",\",\"&IFERROR(VLOOKUP($K12,【選択肢】!$Q$3:$S$118,3,),\" \")&IF(L12=\"\",\"\",\",\"&IFERROR(VLOOKUP($L12,【選択肢】!$Q$3:$S$118,3,),\" \"))))))))","v":""}]
[null,null,null,null,null,{"$f":"SUM(D13+E13)","v":0},null,null,null,null,null,null,{"$f":"IF(G13=\"\",\"\",(IFERROR(VLOOKUP($G13,【選択肢】!$Q$3:$S$118,2,),\" \")&IF(H13=\"\",\"\",\",\"&IFERROR(VLOOKUP($H13,【選択肢】!$Q$3:$S$118,2,),\" \")&IF(I13=\"\",\"\",\",\"&IFERROR(VLOOKUP($I13,【選択肢】!$Q$3:$S$118,2,),\" \")&IF(J13=\"\",\"\",\",\"&IFERROR(VLOOKUP($J13,【選択肢】!$Q$3:$S$118,2,),\" \")&IF(K13=\"\",\"\",\",\"&IFERROR(VLOOKUP($K13,【選択肢】!$Q$3:$S$118,2,),\" \")&IF(L13=\"\",\"\",\",\"&IFERROR(VLOOKUP($L13,【選択肢】!$Q$3:$S$118,2,),\" \"))))))))","v":""},{"$f":"IF(G13=\"\",\"\",(IFERROR(VLOOKUP($G13,【選択肢】!$Q$3:$S$118,3,),\" \")&IF(H13=\"\",\"\",\",\"&IFERROR(VLOOKUP($H13,【選択肢】!$Q$3:$S$118,3,),\" \")&IF(I13=\"\",\"\",\",\"&IFERROR(VLOOKUP($I13,【選択肢】!$Q$3:$S$118,3,),\" \")&IF(J13=\"\",\"\",\",\"&IFERROR(VLOOKUP($J13,【選択肢】!$Q$3:$S$118,3,),\" \")&IF(K13=\"\",\"\",\",\"&IFERROR(VLOOKUP($K13,【選択肢】!$Q$3:$S$118,3,),\" \")&IF(L13=\"\",\"\",\",\"&IFERROR(VLOOKUP($L13,【選択肢】!$Q$3:$S$118,3,),\" \"))))))))","v":""}]
[null,null,null,null,null,{"$f":"SUM(D14+E14)","v":0},null,null,null,null,null,null,{"$f":"IF(G14=\"\",\"\",(IFERROR(VLOOKUP($G14,【選択肢】!$Q$3:$S$118,2,),\" \")&IF(H14=\"\",\"\",\",\"&IFERROR(VLOOKUP($H14,【選択肢】!$Q$3:$S$118,2,),\" \")&IF(I14=\"\",\"\",\",\"&IFERROR(VLOOKUP($I14,【選択肢】!$Q$3:$S$118,2,),\" \")&IF(J14=\"\",\"\",\",\"&IFERROR(VLOOKUP($J14,【選択肢】!$Q$3:$S$118,2,),\" \")&IF(K14=\"\",\"\",\",\"&IFERROR(VLOOKUP($K14,【選択肢】!$Q$3:$S$118,2,),\" \")&IF(L14=\"\",\"\",\",\"&IFERROR(VLOOKUP($L14,【選択肢】!$Q$3:$S$118,2,),\" \"))))))))","v":""},{"$f":"IF(G14=\"\",\"\",(IFERROR(VLOOKUP($G14,【選択肢】!$Q$3:$S$118,3,),\" \")&IF(H14=\"\",\"\",\",\"&IFERROR(VLOOKUP($H14,【選択肢】!$Q$3:$S$118,3,),\" \")&IF(I14=\"\",\"\",\",\"&IFERROR(VLOOKUP($I14,【選択肢】!$Q$3:$S$118,3,),\" \")&IF(J14=\"\",\"\",\",\"&IFERROR(VLOOKUP($J14,【選択肢】!$Q$3:$S$118,3,),\" \")&IF(K14=\"\",\"\",\",\"&IFERROR(VLOOKUP($K14,【選択肢】!$Q$3:$S$118,3,),\" \")&IF(L14=\"\",\"\",\",\"&IFERROR(VLOOKUP($L14,【選択肢】!$Q$3:$S$118,3,),\" \"))))))))","v":""}]
[null,null,null,null,null,0,null,null,null,null,null,null,{"$f":"IF(G15=\"\",\"\",(IFERROR(VLOOKUP($G15,【選択肢】!$Q$3:$S$118,2,),\" \")&IF(H15=\"\",\"\",\",\"&IFERROR(VLOOKUP($H15,【選択肢】!$Q$3:$S$118,2,),\" \")&IF(I15=\"\",\"\",\",\"&IFERROR(VLOOKUP($I15,【選択肢】!$Q$3:$S$118,2,),\" \")&IF(J15=\"\",\"\",\",\"&IFERROR(VLOOKUP($J15,【選択肢】!$Q$3:$S$118,2,),\" \")&IF(K15=\"\",\"\",\",\"&IFERROR(VLOOKUP($K15,【選択肢】!$Q$3:$S$118,2,),\" \")&IF(L15=\"\",\"\",\",\"&IFERROR(VLOOKUP($L15,【選択肢】!$Q$3:$S$118,2,),\" \"))))))))","v":""},{"$f":"IF(G15=\"\",\"\",(IFERROR(VLOOKUP($G15,【選択肢】!$Q$3:$S$118,3,),\" \")&IF(H15=\"\",\"\",\",\"&IFERROR(VLOOKUP($H15,【選択肢】!$Q$3:$S$118,3,),\" \")&IF(I15=\"\",\"\",\",\"&IFERROR(VLOOKUP($I15,【選択肢】!$Q$3:$S$118,3,),\" \")&IF(J15=\"\",\"\",\",\"&IFERROR(VLOOKUP($J15,【選択肢】!$Q$3:$S$118,3,),\" \")&IF(K15=\"\",\"\",\",\"&IFERROR(VLOOKUP($K15,【選択肢】!$Q$3:$S$118,3,),\" \")&IF(L15=\"\",\"\",\",\"&IFERROR(VLOOKUP($L15,【選択肢】!$Q$3:$S$118,3,),\" \"))))))))","v":""}]
{"$rows_left_out":13}
{"sheet":"会議録","index":2,"n_rows":30,"n_cols":15,"rows_kept":30,"cut":false,"hidden":false,"merged":[[1,1,1,5],[13,3,13,4],[14,3,14,4]]}
[]
["令和7年度","　中山間地域等直接支払交付金　会議録",null,null,null,null,null,"会議出席者一覧"]
[]
["会議名","日　付","時　間","場　所","参加者","内　容",null,"氏名＼会議日時",{"$f":"IF($B5<>\"\", $B5, \"\")","v":""},{"$f":"IF($B6<>\"\", $B6, \"\")","v":""},{"$f":"IF(B7<>\"\", B7, \"\")","v":""},{"$f":"IF(B8<>\"\", B8, \"\")","v":""},{"$f":"IF(B9<>\"\", B9, \"\")","v":""},{"$f":"IF(B10<>\"\", B10, \"\")","v":""},{"$f":"IF(B11<>\"\", B11, \"\")","v":""}]
[]
[]
[]
[]
[]
[]
[]
[]
["上記のとおり、会議を開催し、参加者の同意を得ました。"]
[null,null,"協定名：",{"$f":"はじめに!D5&\"\"","v":""}]
[null,null,"代　表：",{"$f":"はじめに!D6&\"\"","v":""},null,"㊞"]
{"$rows_left_out":16}
{"sheet":"金銭出納簿（今年度）","index":3,"n_rows":104,"n_cols":13,"rows_kept":104,"cut":false,"hidden":false,"merged":[[103,1,103,2],[47,1,47,2],[48,1,48,2],[49,1,49,2],[50,1,50,2],[51,1,51,2],[52,1,52,10],[81,5,81,6],[82,5,82,6],[83,5,83,6],[84,5,84,6],[85,5,85,6],[86,5,86,6],[87,5,87,6],[88,5,88,6],[89,5,89,6],[103,5,103,6],[41,1,41,12],[95,5,95,6],[96,5,96,6],[97,5,97,6],[98,5,98,6],[99,5,99,6],[90,5,90,6],[91,5,91,6],[92,5,92,6],[93,5,93,6],[94,5,94,6],[53,6,53,10],[47,5,47,6],[48,5,48,9],[49,5,49,9],[2,7,2,9],[3,6,3,8],[100,5,100,6],[101,5,101,6],[102,5,102,6],[5,1,5,13],[6,1,6,13],[7,1,7,13],[50,5,50,9],[51,5,51,9],[53,1,53,2],[42,1,42,4],[79,1,81,2],[79,4,79,10],[80,7,80,8],[80,9,80,10]]}
[]
[]
[null,null,null,null,null,null,"令和7年度","中山間地域等直接支払交付金 金銭出納簿（当年度）"]
[null,null,null,null,null,null,"（多面的機能支払交付金との共通様式）",null,null,null,"組織名：",{"$f":"はじめに!D5","v":0}]
[null,"★「分類」欄は、分類番号（１～20）から選択してください。"]
[null,"★「区分」欄には、農地維持・資源向上（共同）に係る収支は「１」を、資源向上（長寿命化）に係る収支は「２」を必ず入力してください。\n　　区別ができない収支は「１」を記入してください。（中山間地域等直接支払交付金の場合は記入不要（多面的機能支払交付金の場合は記入））"]
[null,"★農地維持・資源向上（共同）の交付金を活用して資源向上（長寿命化）の活動を行った際の費用は、区分を「１」にし、「長寿命化への活用」欄に○を記入して\n　ください。（中山間地域等直接支払交付金の場合は記入不要（多面的機能支払交付金の場合は記入））"]
[null,"★交付金交付前に活動資金を構成員が一時的に立て替えて会計口座へ繰り入れた場合は、収入欄にその立替額を記入してください。\n　また、返済の際は返済額をマイナスの収入として収入欄に記入し、一時的な立替額が収入/支出の合計に計上されないようにしてください。"]
[null,"日　付","分類","月","内　　容","区分","収入（円）","支出（円）","残高（円）","伝票№","活動実施日","備考","長寿命化への活用"]
[null,null,null,{"$f":"MONTH(B10)","v":1},null,null,null,null,{"$f":"G10-H10","v":0}]
[null,null,null,{"$f":"MONTH(B11)","v":1},null,null,null,null,{"$f":"I10+$G11-$H11","v":0}]
[null,null,null,1,null,null,null,null,{"$f":"I11+$G12-$H12","v":0}]
[null,null,null,1,null,null,null,null,0]
[null,null,null,1,null,null,null,null,0]
[null,null,null,1,null,null,null,null,0]
{"$rows_left_out":90}
{"sheet":"金銭出納簿（前年度）","index":4,"n_rows":105,"n_cols":13,"rows_kept":105,"cut":false,"hidden":false,"merged":[[3,6,3,8],[49,1,49,2],[51,1,51,2],[51,5,51,9],[49,5,49,9],[50,1,50,2],[50,5,50,9],[48,1,48,2],[5,1,5,13],[6,1,6,13],[7,1,7,13],[43,1,43,4],[48,5,48,6],[52,1,52,2],[52,5,52,9],[53,1,53,10],[54,1,54,2],[90,5,90,6],[54,6,54,10],[80,1,82,2],[80,4,80,10],[81,7,81,8],[81,9,81,10],[82,5,82,6],[91,5,91,6],[92,5,92,6],[83,5,83,6],[84,5,84,6],[85,5,85,6],[86,5,86,6],[87,5,87,6],[103,5,103,6],[104,1,104,2],[104,5,104,6],[42,1,42,12],[98,5,98,6],[99,5,99,6],[100,5,100,6],[101,5,101,6],[102,5,102,6],[93,5,93,6],[94,5,94,6],[95,5,95,6],[96,5,96,6],[97,5,97,6],[88,5,88,6],[89,5,89,6]]}
[]
[]
[null,null,null,null,null,null,"令和6年度","中山間地域等直接支払交付金 金銭出納簿（前年度）"]
[null,null,null,null,null,null,"（多面的機能支払交付金との共通様式）",null,null,null,"組織名：",{"$f":"はじめに!D5","v":0}]
[null,"★「分類」欄は、分類番号（１～20）から選択してください。"]
[null,"★「区分」欄には、農地維持・資源向上（共同）に係る収支は「１」を、資源向上（長寿命化）に係る収支は「２」を必ず入力してください。\n　　区別ができない収支は「１」を記入してください。（多面的機能支払交付金の場合）"]
[null,"★農地維持・資源向上（共同）の交付金を活用して資源向上（長寿命化）の活動を行った際の費用は、区分を「１」にし、「長寿命化への活用」欄に○を記入して\n　ください。（多面的機能支払交付金の場合）"]
[null,"★交付金交付前に活動資金を構成員が一時的に立て替えて会計口座へ繰り入れた場合は、収入欄にその立替額を記入してください。\n　また、返済の際は返済額をマイナスの収入として収入欄に記入し、一時的な立替額が収入/支出の合計に計上されないようにしてください。"]
[null,"日　付","分類","月","内　　容","区分","収入（円）","支出（円）","残高（円）","伝票№","活動実施日","備考","長寿命化への活用"]
[null,null,null,{"$f":"MONTH(B10)","v":1},null,null,null,null,{"$f":"G10-H10","v":0}]
[null,null,null,{"$f":"MONTH(B11)","v":1},null,null,null,null,{"$f":"I10+$G11-$H11","v":0}]
[null,null,null,1,null,null,null,null,{"$f":"I11+$G12-$H12","v":0}]
[null,null,null,1,null,null,null,null,{"$f":"I12+$G13-$H13","v":0}]
[null,null,null,1,null,null,null,null,{"$f":"I13+$G14-$H14","v":0}]
[null,null,null,1,null,null,null,null,0]
{"$rows_left_out":91}
{"sheet":"【選択肢】","index":5,"n_rows":247,"n_cols":24,"rows_kept":247,"cut":false,"hidden":false,"merged":[[1,5,1,9],[16,2,16,6],[20,23,21,25],[0,16,0,20],[0,21,1,21],[0,22,1,22],[1,18,1,19],[0,0,0,9]]}
[null,null,null,null,null,null,null,null,null,null,null,null,null,null,null,null,"活動記録で選択された取組番号から、区分、項目、取組を自動入力するための表",null,null,null,null,"実施回数のカウント","←活動記録に取組番号が入力された回数をカウントし、これをもとに実施状況報告書の「実施欄」の○、×を判定しています。","都道府県の要綱基本方針において取組を追加した場合の設定方法（県の担当者が作業してください）"]
["A.■か□","B.○か空白","C.○か－か×","D.農村環境保全活動のテーマ","E.高度な保全活動","F.施設（長寿命化）",null,null,null,null,"G.単位","H.構成員一覧の分類","I.金銭出納簿の区分","J.金銭出納簿の収支の分類",null,"プルダウン用","番号","支払区分","活動項目",null,"取組",null,null,"要綱基本方針において取組を追加した場合、以下の方法により修正することができます。"]
["■","○","○","生態系保全","循環かんがいによる水質保全","水路","61　水路の補修","62　水路の更新等",null,null,"km","１.農業者個人",1,"１.前年度持越",null,"○",200,"-","事務処理","事務処理","200 事務処理",null,null,"●共通：活動記録で、追加した取組番号を入力できるようにする"]
["□",null,"－","水質保全","浄化水路による水質保全","農道","63　農道の補修","64　農道の更新等",null,null,"箇所","２.農事組合法人",2,"２.交付金",null,"○",300,"-","会議","会議","300 会議",null,null,"　１）「取組番号早見表シート」及び「取組番号シート」に番号、支払区分、活動項目、取組を追加する。"]
[null,null,"×","景観形成・生活環境保全","地下水かん養","ため池","65　ため池の補修","66　ため池（附帯施設）の更新等",null,null,null,"３.営農組合",null,"３.利子等",null,"○",null,null,null,null,null,null,null,"　２）「選択肢」シートのP列～T列の74行以降に行を挿入し、追加した取組番号、支払区分、活動項目、取組を入力する。"]
[null,null,null,"水田貯留・地下水かん養","持続的な水管理",null,null,null,null,null,null,"４.その他の農業者団体",null,"４.日当",null,"○",1,"農地維持","点検・計画策定","点検","1 点検",null,null,"　３）「選択肢」シートU列の74行以降にU73セル（活動記録に入力された回数のカウントを行う数式）をコピーする。　"]
[null,null,null,"資源循環","土壌流出防止",null,null,null,null,null,null,"５.農業者以外個人",null,"５.外注費",null,"○",2,"農地維持","点検・計画策定","計画策定","2 年度活動計画の策定",null,null,"　　　（この作業により、活動記録に取組番号が入力された回数がＰ列に入力され、これをもとに実施状況報告書の「実施欄」の○、×を判定します。）"]
[null,null,null,null,"生物多様性の回復",null,null,null,null,null,null,"６.自治会",null,"６.その他支出",null,"○",3,"農地維持","研修","研修","3 事務・組織運営等に関する研修、機械の安全使用に関する研修"]
[null,null,null,null,"水環境の回復",null,null,null,null,null,null,"７.女性会",null,"７.返還",null,"○",4,"農地維持","実践活動","農用地","4 遊休農地発生防止のための保全管理",null,null,"●農村環境保全活動、多面的機能の増進を図る活動、長寿命化のための活動を追加する場合は以下の設定を行う"]
[null,null,null,null,"持続的な畦畔管理",null,null,null,null,null,null,"８.子供会",null,null,null,"○",5,"農地維持","実践活動","農用地","5 畦畔・法面・防風林の草刈り",null,null,"①農村環境保全活動の項目を追加する場合"]
[null,null,null,null,"専門家の指導",null,null,null,null,null,null,"９.土地改良区",null,null,null,"○",6,"農地維持","実践活動","農用地","6 鳥獣害防護柵等の保守管理",null,null,"活動計画書３（２）１）で実践活動を選択する際に、追加した項目を選択できるようにする"]
[null,null,null,null,null,null,null,null,null,null,null,"10.JA",null,null,null,"○",7,"農地維持","実践活動","水路","7 水路の草刈り",null,null,"　１）「選択肢」シートのV列の「50　地域資源の活用・資源循環活動（資源循環）」の下に取組名を入力する。"]
[null,null,null,null,null,null,null,null,null,null,null,"11.学校・PTA",null,null,null,"○",8,"農地維持","実践活動","水路","8 水路の泥上げ",null,null,"　　　　このとき、「●共通」で入力した取組名と同じになるように注意してください。"]
[null,null,null,null,null,null,null,null,null,null,null,"12.NPO",null,null,null,"○",9,"農地維持","実践活動","水路","9 水路附帯施設の保守管理",null,null,"　２）「数式」タブの「名前の管理」を選択し、リストの中から「K.農村環境保全活動」を選択し、「参照範囲」の右のアイコンをクリック"]
[null,null,null,null,null,null,null,null,null,null,null,"13.その他の農業者以外団体",null,null,null,"○",10,"農地維持","実践活動","農道","10 農道の草刈り",null,null,"　３）参照範囲に追加した取組を含むよう範囲を選択し直し、確定する。"]
{"$rows_left_out":232}